Clang error linker command failed with exit code 1 terminal

Your source code file does not define a function with that name, so it is not a valid MEX- file and when you attempt to build it as though it was a valid MEX- file the compiler correctly complains. Forums > Unity Community Discussion. clang: error: linker command failed with exit code 1 ( use - v to see invocation). you either need to remove the directory. To confirm: I just tried building the GVRDemo scene for iOS, from the Google VR SDK for Unity version 1. 1, using Unity 5. I set the bundle identifier to a custom value, set the target minimum iOS version to 8. 0, enabled Virtual Reality supported, added ' Cardboard' VR SDK, and was able to open the built Xcode *. xcworkspace, and run it on an iPhone 6s with iOS 11. clang- cl is an alternative command- line interface to Clang, designed for compatibility with the Visual C+ + compiler, cl. To enable clang- cl to find system headers, libraries, and the linker when run from the command- line, it should be executed inside a Visual Studio Native Tools Command Prompt or a regular Command Prompt where the. If you dig through the command text, it appears that Xcode doesn’ t use quotes for the library passed to the - dead_ strip command.

  • System returned error code 5
  • Phantasy star online 2 character creation error code
  • Sony playstation network error code 80710b23
  • Hp 6830 problem with printhead error code


  • Video:Code terminal linker

    Clang command failed

    This may be peculiar to projects with sub- projects. Xcode will download package and install copies of the core command line tools and system headers into system folders, including the LLVM compiler, linker, and build tools. Step # 3: Verification Open a terminal app and type the following commands:. CUDA samples on Mac OS X Mavericks ( 10. 9) / matrixMulDrv. error: linker command failed with exit code 1 ( use - v to see invocation). Run ' xcode- select - - install. 226 clang: error: linker command failed with exit code 1 ( use - v to see invocation). error: linker command failed with exit code 1. The full terminal output. ld: symbol( s) not found for architecture x86_ 64 clang: error: linker command failed with exit code 1 ( use - v to see invocation) - 3 MAC OSX Xcode 9. 2 linker command failed with exit code 1 ( use - v to see invocation). The compiler command is make test ( unless you want to supply all the switches for clang). Notice that make echos to the terminal the actual clang command it uses.

    clang: error: linker command failed with exit code 1 ( use - v to see invocation) SOLUTION : Please ensure that you have a MicroBlink file in the MicroBlink. framework folder and that file has approximately 100MB. Python安装mysqlclient提示“ clang: error: linker command failed with exit code 1 ( use - v to see invocation) ” 解决方法. Mac下打开terminal, 输入以下. Login + Screen Name Required to Post. Login to participate so you can start earning points. Once you' re logged in ( and have a screen name entered in your profile), you can subscribe to topics, follow users, and start learning how to make apps like the pros. I' m trying to build wxFormBuilder_ v3. 0- beta- source on Mac OS X 10. 4 and yes I have XCode installed and have successfully built/ installed C+ + projects on this machine before. I' m using GeoFire ( 2. 0) in the Swift project, after today' s update pods when the project is going to Xcode shows clang: error: linker command failed with exit code 1 ( use - v to see invocation) in the Geofire framework. Objective- C and Swift. 1) I created a file with the command:.

    clang: error: linker command failed with exit code 1 ( use - v to see invocation) But last time I opened the project in Version 7. x( i forget the version) Xcode. I didn' t get this issues. This is hasty and idle speculation, but if you' re targeting iOS 5 at the minimum, including the ARM v6 architecture isn' t necessary, is it? What happens if you change the ARCHs to armv7 only? When I run the command " make - B - f Makefile. mac NameRedacted. bundle MAYA_ VERSION= maya; " in the terminal, I get the response: " ld: framework not found System clang: error: linker command failed with exit code 1 ( use - v to see invocation). Normally this sort of failure happens when compiling your C+ + code by invoking the C front- end. The gcc you execute understands and compiles the file as C+ +, but doesn' t link it with the C+ + libraries. clang: error: linker command failed with exit code 1 ( use - v to see invocation) " I' m trying to build to an iPhone 6 running iOS 9. Architectures is set to ' Standard Architectures'. Either the SDKROOT setting in your project got corrupted with extra spaces ( assuming those spaces are not a typo) or something is wrong with your copy of Xcode ( if those spaces are a typo). linker command failed with exit code 1” and other errors when using make up vote 0 down vote favorite I get multiple errors when I try to compile speller.

    Introduction to Linux - A Hands on Guide This guide was created as an overview of the Linux Operating System, geared toward new users as an exploration tour and getting started guide, with exercises at the end of each chapter. Hi and thank you for your feedback. It seems your environment isn' t properly configured and can' t find libSDLmain. By the way, if you installed Netbeans you can just open and run the project with the IDE instead of running make, but that won' t fix your problem though. 7) In the terminal, navigate to where you would like to download the Android source code. The commands below will make it in your home folder, but if you have limited space you may want to create it somewhere else. com/ There were a few suggestions online on how to fix this issue, but this is the solution that worked for me; really simple. But now when I tried to use ' clang test. cpp' it threw over a hundred errors and failed while g+ + plugged along just fine on the same file. When I did ' clang - c test. cpp' it did run through all the way to the linker phase without issues. First of all delete all Xcode settings, this will reset Xcode to default, open up terminal, type defaults delete com. Xcode and hit enter. Then in Xcode, Option+ Shift+ Command+ K to clean the build folder, then run the compile and it should work. Executing program without an IDE.

    error: linker command failed with exit code 1". for architecture x86_ 64 clang: error: linker command failed with exit code 1. ld: library not found for - lPods- { projectName} clang: error: linker command failed with exit code 1 ( use - v to see invocation) ( even going further as to add the additional references to my podfile as you described further on in the iOS instructions and updating the node_ modules references appropriately, this executed with no errors). clang: error: linker command failed with exit code 1 ( use - v to see invocation) If you can say anything about then it would be really helpful. This comment has been minimized. Stack Exchange network consists of 174 Q& A communities including Stack Overflow, the largest, most trusted online community for developers to learn, share their knowledge, and build their careers. can' t fix ' Linker command failed with exit code 1( use - v to see invocation) '. with clang: error: linker command failed with exit code 1. type " Interface Builder. ld: library not found for - lPods clang: error: linker command failed with exit code 1 ( use - v to see invocation) 」 のようなエラーが出ます。 ちょっと困りましたが、 調べてみたら. Example message: I was wondering if you' d be able to help me with some Linear Programming problems. I' m in an undergraduate Operations Management course and some of the questions on my homework about seasonality are confusing me.