Sub process usr bin dpkg an error code 1

Now I can' t continue it/ remove it to start again. dpkg: error processing archive / var/ cache. Sub- process / usr/ bin/ dpkg returned an error code ( 1). Sub- process / usr/ bin/ dpkg returned an error. · I just installed Debian, and I am upgrading to unstable. When I do the command apt- get upgrade I recieve the an error saying Sub- Process / usr/ bin/ dpkg. · Hola nahwellness Supongo que has puesto: al analizar el fichero ` / var/ lib/ dpkg/ available' cerca de la línea 49455 paquete ' vino' : campo ` Depends', nombre. · Join Date Apr Location Rawalpindi, Pakistan Beans 5, 666 Distro Ubuntu Gnome Development Release. Ошибка ( E: Sub- process / usr/ bin/ dpkg returned an error. Sub- process / usr/ bin/ dpkg returned an error code ( 1) Как ее исправить? 4 설치 에러 - E: Sub- process / usr/ bin/ dpkg returned an error code ( 1). Sub- process / usr/ bin/ dpkg returned an error code ( 1) 표지됨: omeka;.

  • Mood music error code 7
  • Hp 6830 problem with printhead error code
  • Error detection and correction using hamming code ppta
  • Error code p0018 and p0022
  • 8889 forms frmservlet error code


  • Video:Dpkg process code

    Process dpkg error

    dpkg: error processing package mysql- server. · I recently ran into the following error in Ubuntu ( v 13. Due to this error i was not able to run the update. Here is the fix to this error. Can anyone help a n00b out? I should have enough space on my SD. df - h results are below. sda1 is for NAS storage. I' d appriciate any input whatsoever, and thanks in. I' ve been using Ubuntu for a few years now, but I just installed Version 16.

    04, and I' ve been having a lot of issues. I' m not a command line programmer, but I tried. · Hi Guys how to fix this problem? apt- get upgrade Reading package lists. Done Building dependency tree Reading state information. Hallo Helfer- Gemeinde. Seit einigen Tagen bekomme ich bei jedem Aufruf der Paketverwaltung die oben genannte Fehlermeldung. Die empfohlenen allgemeinen. 1] Comentário enviado por fabio em 28/ 02/ : 26h Bela dica! Mas ao invés do malabarismo pra deletar os arquivos, acho que o comando abaixo seria mais adequado:. post- installation script returned error exit status 1.

    Holas, en un hosting que me permite instalar un server debian al actualizar por apt- get update / upgrade no me permite actualizar el kernel. el error que me da con. · cd / var/ lib/ dpkg/ info sudo mkdir tex- common sudo mv tex- common. * tex- common 这个方法是根据方案一想出来的, 也可以解决这个错误. Error while installing Apache; error is “ E:. Sub- process / usr/ bin/ dpkg returned an error code ( 1) 일단 여기서 문제가 생긴 것은 icaclient. I' ve prepared a step by step guide to fix Cydia iOS sub- process / usr / bin / dpkg returned an error code ( 2). · I struggle for a few days. Unfortunately i couldn' t google out any reasonable explanation why is this happening. First i had some problems with syslog. · 之前是项目中用的Docker容器, 后来前天突然docker起服务, 起不来了, 报错误如下: FATA[ 0000] Cannot connect to the Docker daemon. com/ solve- sub- process- usr- bin- dpkg- returned- error- code- 1- error/ Follow dpkg is a tool used to install packages into a Debian, Ubuntu, Mint, Kali or. aborted at / usr/ sbin/ update- mime line 76.

    usr/ bin/ dpkg returned an error code ( 1). · How To Fix Cydia Error Code 1; cydia sub- process / usr/ bin/ dpkg returned an error code ( 1) Method 1 failed in buffer_ write( fd) ( 8, ret= - 1) cydia sub- process. I am trying to install apache: sudo apt- get install apache2 And i am getting this error: Setting up google- cloud- sdk ( 132. dpkg: error processing package. · BEGIN PGP SIGNED MESSAGEHash: SHA1. On Mon, Dec 22, at 2: 52 PM, Sven Joachim wrote: > > If you still have your terminal open, send the complete output. E: Sub- process / usr/ bin/ dpkg returned an error code ( 1) 우분투에서 위와 같은 에러가 발생한 경우 의존성 문제가 발생했다라고 볼 수 있다. - error: / usr/ bin/ dpkg returned an code ( 1). solucion del error usr/ bin/ dpkg returned an code ( 1). Fix Cydia Error Messages iOS 9. I am running on xen, Debian 5. 0- i386- default.

    I haven' t touched my vps in 2 months then last night I ran the following command: myserver: / usr/ bin# apt- get upgrade. · 问题 终端出现 Sub- process / usr/ bin/ dpkg returned an error code ( 1). I' ve seen this message several times whenever someone has a problem installing, upgrading or removing some piece of software, but I wonder, what does it mean, and. При обновлении пакетов Ubuntu появляется ошибка « E: Sub- process / usr/ bin/ dpkg returned an error code», при этом. · Here are a few ways you can fix the common update error “ sub process usr bin dpkg returned an error code 1″ in Ubuntu and other Debian based Linux. Stack Exchange network consists of 174 Q& A communities including Stack Overflow, the largest, most trusted online community for developers to learn, share their. · 在ubuntu下使用apt- get install 安装资源的时候, 总是会遇到Sub- process / usr/ bin/ dpkg returned an error code ( 1) 错了, 跟安装软件. 在用apt- get安装软件时出现了类似于install- info: No dir file specified; try – help for more information. dpkg: 处理 gettext ( – configure) 时出错. cydia sub- process / usr/ bin/ dpkg returned an error code. sub- process / usr/ bin/ dpkg returned an error code ( 2). process / usr/ bin/ dpkg returned an error code ( 1). Ошибка при обновлении или установке чего либо, cupsys Sub- process / usr/ bin/ dpkg.

    Could not exec dpkg! E: Sub- process / usr/ bin/ dpkg. “ Sub- process / usr/ bin/ dpkg returned an error code ( 1). Sub- process / usr/ bin/ dpkg returned an error code.